Home > Cannot Run > Cannot Run Program Phpcs

Cannot Run Program Phpcs

Stack Overflow | 7 months ago | automatix java.io.IOException: Cannot run program "phpcs": error=2, No such file or directory find similars Java RT 0 0 mark build php jenkins composer-php build.xml share|improve this question edited Apr 6 at 18:06 asked Apr 5 at 15:37 automatix 1,65073090 add a comment| 1 Answer 1 active oldest votes up vote 0 Why does the Minus World exist? The only way to setup (reconfigure) phing is through Phing Build View > Settings. his comment is here

But it seems that most prefer to run Jenkins on a Linux box. Join Now I want to fix my crash I want to help others java.io.IOException: Cannot run program "git": error=2, No such file or directory Stack Overflow | sathya | 4 years We recommend upgrading to the latest Safari, Google Chrome, or Firefox. Reload to refresh your session. https://github.com/klaussilveira/gitlist/issues/403

https://github.com/sebastianbergmann/phpcpd Relevant error lines: phpcpd: BUILD FAILED /home/oliver/gitlist/build.xml:70: Execute failed: java.io.IOException: Cannot run program "phpcpd": java.io.IOException: error=2, No such file or directory at java.lang.ProcessBuilder.start(ProcessBuilder.java:488) at java.lang.Runtime.exec(Runtime.java:610) at org.apache.tools.ant.taskdefs.Execute$Java13CommandLauncher.exec(Execute.java:862) at org.apache.tools.ant.taskdefs.Execute.launch(Execute.java:481) at What was Stan Lee's character reading on the bus in Doctor Strange How do pilots identify the taxi path to the runway? klaussilveira added a commit that referenced this issue May 17, 2014 klaussilveira Proper dev tools bin path, fixes

What is the total sum of the cardinalities of all subsets of a set? Didn't find what you were looking for? more stack exchange communities company blog Stack Exchange Inbox Reputation and Badges sign up log in tour help Tour Start here for a quick overview of the site Help Center Detailed Like this:Like Loading...

GitHub | 2 years ago | svencc java.io.IOException: CANNOT RUN PROGRAM "/opt/appserver/bin/phpize" (in directory "/home/sven/runtime/target/pthreads-1.0.5"): error=2, No such file or directory find similars Java RT 0 0 How to install Mediawiki in Ubuntu What crime would be illegal to uncover in medieval Europe? Content Relevant URLs by vBSEO 3.6.0 PL2 HomeDevCentralQueriesOpen TasksAll TasksSearchAdvanced SearchActionsManiphest HelpManiphest HelpQuick ActionsQuick ActionsLog InLog InSearchCreate TaskCreate TaskSSH key requestServer outageCreate BadgeCreate EventCreate FormCreate PasteCreate URLCreate ProjectCreate BlogCreate PostEmail HelpEmail a fantastic read So the problem must have been caused by something else.

Get Composer so it will manage your PHP project dependencies for you: curl -s http://getcomposer.org/installer | php sudo mv composer.phar /usr/local/bin/composer Instructions for using Composer are below, also on the Composer Create the file /etc/init.d/autoexec.sh and put the following contents into it: #/etc/init.d/autoexec.sh #start SSH server and open port 8081 to external HTTP connections service ssh start iptables -I INPUT Sign in to comment Contact GitHub API Training Shop Blog About © 2016 GitHub, Inc. asked 7 months ago viewed 217 times active 7 months ago Upcoming Events 2016 Community Moderator Election ends Nov 22 Linked 0 How to get Jenkins working with binaries from a

If you’re writing unit tests and using a source code versioning system, such as SVN or Git, you might want to try Jenkins CI for PHP. Is there a way to get the build.xml loaded in Phing view in intellij idea ultimate 11.1.1?Thank you in advanceBest regards 0 Elena Shaverdova Last update January 18, 2016 02:38 Permalink Hot Network Questions Inequality caused by float inaccuracy addFieldToFilter() And Condition in magento2 How to grep two numbers from the same line at different places using bash? Browse other questions tagged php jenkins composer-php build.xml or ask your own question.

Accept & Close Sign In Create Account Search among 980,000 solutions Search Your bugs help others We want to create amazing apps without being stopped by crashes. this content In Doctor Strange what was the title of the book Stan Lee was reading in his cameo? Join us to help others who have the same bug. Is there a word for turning something into a competition?

Here's the error output: Started by user anonymousUpdating file:///D://SVN/MyProjectRepository/trunk/public_htmlAt revision 38[workspace] $ cmd.exe /C '"ant.bat -file build.xml && exit %%ERRORLEVEL%%"'Buildfile: C:\Servers\Jenkins\jobs\MyProject\workspace\build. Do humans have an obligation to prevent animal on animal violence? Frustration level: 7/10 -- Update: It seems that the jenkins user doesn't execute the commands in a bash shell, so adding the path in the .bash_profile does nothing for Jenkins. weblink By bigdata in forum PHP Replies: 0 Last Post: 11-07-2013, 01:11 PM Android-Android-Jenkins: failed to find Build Tools revision 17.0.0 On Jenkins Build By bigdata in forum Android Applications Replies: 0

New post © 2000— JetBrains s.r.o. Still there are some permission issues that breaks the build. Automated exception search integrated into your IDE Test Samebug Integration for IntelliJ IDEA 0 mark ImageMagick commands are not working from JAVA code in OSX Stack Overflow | 2 years ago

Why are LEDs in my home unaffected by voltage drop?

Can clients learn their time zone on a network configured using RA? Note that .bat files cannot in general by executed directly. Related 1462How do I get a YouTube video thumbnail from the YouTube API?394How to choose between Hudson and Jenkins?537How to restart Jenkins manually?2Jenkins (w/ Mercurial pulgin) when does build.xml get written? Why do languages require parenthesis around expressions when used with "if" and "while"?

In the jenkins system configuration (e.g. http://localhost:8080/configure) you can set variables for the jenkins user that will work at runtime. Take a tour to get the most out of Samebug.

Tired of useless tips? But there was still an issue with phpcs: phpcs: [phpcs] 'php' is not recognized as an internal or external command, [phpcs] operable program or batch file. [phpcs] Result: 1 This is check over here When I manually start the build I get error messages that it cannot run certain programs (--> the PHP tools), although they are correctly installed (through Pear) and are executable through

Installing the PHP Project Wizard This will provide you with a Jenkins PHP project template that you can copy and modify as needed. current community chat Stack Overflow Meta Stack Overflow your communities Sign up or log in to customize your list. Personal Open source Business Explore Sign up Sign in Pricing Blog Support Search GitHub This repository Watch 171 Star 2,370 Fork 456 klaussilveira/gitlist Code Issues 132 Pull requests 10 Projects Run Composer to create your autoload file: composer install Run the PHP Project Wizard to set up the rest of your project directory structure: ppw --source src --tests tests --name helloworld

I configured Jenkins for my local Java and Ant installations and I set up my first project. Why do the cars die after removing jumper cables What are the applications of taking the output of an amp with a microphone? The cost of switching to electric cars? Switch user to 'jenkins' using: sudo su - jenkins and add this to ~/.bash_profile: PATH="$PATH:/opt/bitnami/php/bin" Save, then reboot your VM and retry your build.

Then: sudo service jenkins restart; Next, we set up an autoexecute file so that the SSH service is started when the VM is turned on. asked 4 years ago viewed 1733 times active 2 years ago Upcoming Events 2016 Community Moderator Election ends Nov 22 Related 12How to set $_SERVER[' '] variables when running phpunit tests This will take care of installing all of the dependencies you list in composer.json. Currently.- Phing support is in Phing plugin, not in Php plugin.

That is only used by the shell. What can it be? What is the total sum of the cardinalities of all subsets of a set? All rights reserved.

The direct executing of the build.xml with ant works. When I log in via the terminal to Jenkins like this: sudo -s -H -u jenkins and try pdepend it works as expected. Currently, this is the status: BUILD FAILED
/Users/Shared/Jenkins/Home/jobs/test/workspace/build.xml:28:
The following error occurred while executing this line:
/Users/Shared/Jenkins/Home/jobs/test/workspace/build.xml:39: Execute failed: java.io.IOException: Cannot run program "pdepend": error=2, No such file Try specifying the entire path to the pdepend command. ..

Phing [email protected]:~$ ll ~/development/tools/phing/total 88drwxrwxr-x 7 jtonic jtonic  4096 Apr 28 13:34 ./drwxr-xr-x 8 jtonic jtonic  4096 Apr 28 13:34 ../drwxrwxr-x 2 jtonic jtonic  4096 Jan  1  1970 bin/-rw-r--r-- 1 jtonic jtonic 40099 Apr  6 21:42 CHANGELOG.mddrwxrwxr-x This site uses cookies, as explained in our cookie policy. But for some reason it won't work when executed from the Jenkins server. So in my case the working target specification looks as follows: